Jump to content

Resource style/Theme.WaveVR.Loading not found in AndroidManifest.xml


Fangh
 Share

Recommended Posts

When I try to build for my HTC Vive Focus Plus, I have this error.

  • Unity 2019.4.29f1
  • Minimum API Level 7.1 (25)
  • Target API Level (Automatic)
  • IL2CPP
  • .Net 4.x
  • New Input System

 

 

> Task :launcher:preBuild UP-TO-DATE
> Task :unityLibrary:preBuild UP-TO-DATE
> Task :unityLibrary:preReleaseBuild UP-TO-DATE
> Task :launcher:prepareLintJar UP-TO-DATE
> Task :unityLibrary:checkReleaseManifest UP-TO-DATE

> Task :unityLibrary:processReleaseManifest
T:\Mes documents\Unity Project\svodvrxp\Temp\gradleOut\unityLibrary\src\main\AndroidManifest.xml:3:3-19:17 Warning:
	application@android:theme was tagged at AndroidManifest.xml:3 to replace other declarations but no other declaration present

> Task :unityLibrary:compileReleaseAidl NO-SOURCE
> Task :unityLibrary:packageReleaseRenderscript NO-SOURCE
> Task :unityLibrary:compileReleaseRenderscript NO-SOURCE
> Task :unityLibrary:generateReleaseBuildConfig UP-TO-DATE
> Task :unityLibrary:generateReleaseResValues UP-TO-DATE
> Task :unityLibrary:generateReleaseResources UP-TO-DATE
> Task :unityLibrary:packageReleaseResources UP-TO-DATE
> Task :unityLibrary:generateReleaseRFile UP-TO-DATE
> Task :unityLibrary:prepareLintJar UP-TO-DATE
> Task :unityLibrary:generateReleaseSources UP-TO-DATE
> Task :launcher:preReleaseBuild
> Task :launcher:compileReleaseAidl NO-SOURCE
> Task :launcher:compileReleaseRenderscript NO-SOURCE
> Task :launcher:checkReleaseManifest UP-TO-DATE
> Task :unityLibrary:javaPreCompileRelease UP-TO-DATE
> Task :launcher:generateReleaseBuildConfig UP-TO-DATE
> Task :launcher:generateReleaseSources UP-TO-DATE
> Task :launcher:mainApkListPersistenceRelease UP-TO-DATE
> Task :launcher:generateReleaseResValues UP-TO-DATE
> Task :launcher:generateReleaseResources UP-TO-DATE
> Task :unityLibrary:compileReleaseJavaWithJavac UP-TO-DATE
> Task :unityLibrary:bundleLibCompileRelease UP-TO-DATE
> Task :unityLibrary:prepareLintJarForPublish UP-TO-DATE
> Task :unityLibrary:mergeReleaseShaders UP-TO-DATE
> Task :unityLibrary:compileReleaseShaders UP-TO-DATE
> Task :unityLibrary:generateReleaseAssets UP-TO-DATE
> Task :launcher:mergeReleaseResources UP-TO-DATE
> Task :launcher:javaPreCompileRelease UP-TO-DATE
> Task :launcher:createReleaseCompatibleScreenManifests UP-TO-DATE
> Task :unityLibrary:packageReleaseAssets
> Task :launcher:processReleaseManifest
> Task :unityLibrary:bundleLibRuntimeRelease UP-TO-DATE
> Task :unityLibrary:processReleaseJavaRes NO-SOURCE
> Task :unityLibrary:bundleLibResRelease UP-TO-DATE
> Task :unityLibrary:mergeReleaseJniLibFolders UP-TO-DATE
> Task :unityLibrary:transformNativeLibsWithMergeJniLibsForRelease UP-TO-DATE
> Task :unityLibrary:transformNativeLibsWithStripDebugSymbolForRelease UP-TO-DATE
> Task :unityLibrary:transformNativeLibsWithIntermediateJniLibsForRelease UP-TO-DATE
> Task :launcher:processReleaseResources FAILED

Deprecated Gradle features were used in this build, making it incompatible with Gradle 6.0.
Use '--warning-mode all' to show the individual deprecation warnings.
See https://docs.gradle.org/5.1.1/userguide/command_line_interface.html#sec:command_line_warnings
31 actionable tasks: 5 executed, 26 up-to-date

UnityEngine.GUIUtility:ProcessEvent (int,intptr)

 


FAILURE: Build failed with an exception.

* What went wrong:
Execution failed for task ':launcher:processReleaseResources'.
> Android resource linking failed
  T:\Mes documents\Unity Project\svodvrxp\Temp\gradleOut\launcher\build\intermediates\merged_manifests\release\AndroidManifest.xml:38: AAPT: error: resource style/Theme.WaveVR.Loading (aka com.sixfreedom.svodvrxp:style/Theme.WaveVR.Loading) not found.
      
  error: failed processing manifest.

* Try:
Run with --stacktrace option to get the stack trace. Run with --info or --debug option to get more log output. Run with --scan to get full insights.

* Get more help at https://help.gradle.org

BUILD FAILED in 2s
Picked up JAVA_TOOL_OPTIONS: -Dfile.encoding=UTF-8

UnityEngine.GUIUtility:ProcessEvent (int,intptr)

 

 

> Task :launcher:preBuild UP-TO-DATE
> Task :unityLibrary:preBuild UP-TO-DATE
> Task :unityLibrary:preReleaseBuild UP-TO-DATE
> Task :launcher:prepareLintJar UP-TO-DATE
> Task :unityLibrary:checkReleaseManifest UP-TO-DATE

> Task :unityLibrary:processReleaseManifest
T:\Mes documents\Unity Project\svodvrxp\Temp\gradleOut\unityLibrary\src\main\AndroidManifest.xml:3:3-19:17 Warning:
	application@android:theme was tagged at AndroidManifest.xml:3 to replace other declarations but no other declaration present

> Task :unityLibrary:compileReleaseAidl NO-SOURCE
> Task :unityLibrary:packageReleaseRenderscript NO-SOURCE
> Task :unityLibrary:compileReleaseRenderscript NO-SOURCE
> Task :unityLibrary:generateReleaseBuildConfig UP-TO-DATE
> Task :unityLibrary:generateReleaseResValues UP-TO-DATE
> Task :unityLibrary:generateReleaseResources UP-TO-DATE
> Task :unityLibrary:packageReleaseResources UP-TO-DATE
> Task :unityLibrary:generateReleaseRFile UP-TO-DATE
> Task :unityLibrary:prepareLintJar UP-TO-DATE
> Task :unityLibrary:generateReleaseSources UP-TO-DATE
> Task :launcher:preReleaseBuild
> Task :launcher:compileReleaseAidl NO-SOURCE
> Task :launcher:compileReleaseRenderscript NO-SOURCE
> Task :launcher:checkReleaseManifest UP-TO-DATE
> Task :unityLibrary:javaPreCompileRelease UP-TO-DATE
> Task :launcher:generateReleaseBuildConfig UP-TO-DATE
> Task :launcher:generateReleaseSources UP-TO-DATE
> Task :launcher:mainApkListPersistenceRelease UP-TO-DATE
> Task :launcher:generateReleaseResValues UP-TO-DATE
> Task :launcher:generateReleaseResources UP-TO-DATE
> Task :unityLibrary:compileReleaseJavaWithJavac UP-TO-DATE
> Task :unityLibrary:bundleLibCompileRelease UP-TO-DATE
> Task :unityLibrary:prepareLintJarForPublish UP-TO-DATE
> Task :unityLibrary:mergeReleaseShaders UP-TO-DATE
> Task :unityLibrary:compileReleaseShaders UP-TO-DATE
> Task :unityLibrary:generateReleaseAssets UP-TO-DATE
> Task :launcher:mergeReleaseResources UP-TO-DATE
> Task :launcher:javaPreCompileRelease UP-TO-DATE
> Task :launcher:createReleaseCompatibleScreenManifests UP-TO-DATE
> Task :unityLibrary:packageReleaseAssets
> Task :launcher:processReleaseManifest
> Task :unityLibrary:bundleLibRuntimeRelease UP-TO-DATE
> Task :unityLibrary:processReleaseJavaRes NO-SOURCE
> Task :unityLibrary:bundleLibResRelease UP-TO-DATE
> Task :unityLibrary:mergeReleaseJniLibFolders UP-TO-DATE
> Task :unityLibrary:transformNativeLibsWithMergeJniLibsForRelease UP-TO-DATE
> Task :unityLibrary:transformNativeLibsWithStripDebugSymbolForRelease UP-TO-DATE
> Task :unityLibrary:transformNativeLibsWithIntermediateJniLibsForRelease UP-TO-DATE
> Task :launcher:processReleaseResources FAILED

Deprecated Gradle features were used in this build, making it incompatible with Gradle 6.0.
Use '--warning-mode all' to show the individual deprecation warnings.
See https://docs.gradle.org/5.1.1/userguide/command_line_interface.html#sec:command_line_warnings
31 actionable tasks: 5 executed, 26 up-to-date

UnityEngine.GUIUtility:ProcessEvent (int,intptr)

 

 

 

2021-10-08 11_24_18-svodvrxp - Untitled - Android - Unity 2019.4.29f1 [PREVIEW PACKAGES IN USE] _DX1.jpg

2021-10-08 11_24_35-svodvrxp - DebugInput - Android - Unity 2019.4.29f1 [PREVIEW PACKAGES IN USE] _D.jpg

2021-10-08 11_24_42-Window.jpg

2021-10-08 11_24_48-Window.jpg

Link to comment
Share on other sites

Create an account or sign in to comment

You need to be a member in order to leave a comment

Create an account

Sign up for a new account in our community. It's easy!

Register a new account

Sign in

Already have an account? Sign in here.

Sign In Now
 Share

×
×
  • Create New...